{"text_format":"1","workbook":"xlsx","n_sheets":5,"sheets":["UrlaubsAntrag","Abteilungen","Namen","Feiertage in den BL","! Bedienungsanleitung !"],"not_rendered":{"charts":0,"images":8,"macros":1,"external_links":0,"defined_names":4,"comments":1,"pivot_tables":0},"unopened":[],"bounds":{"document_bytes":16777216,"sheet_cells":100000,"rows_first":2000,"rows_last":500,"rows_between":2000,"halvings":0,"cell_chars":16384,"cell_head_chars":4096},"cells_cut":0,"cells_raw":0,"read":"whole","date_system":"1900"}

{"sheet":"UrlaubsAntrag","index":0,"n_rows":333,"n_cols":52,"rows_kept":333,"cut":false,"hidden":false,"merged":[[24,9,24,11],[7,13,7,15],[7,17,7,19],[23,5,23,7],[19,4,19,7],[24,5,24,7],[17,3,17,7],[22,0,22,7],[11,0,11,7],[8,1,8,2],[2,9,2,11],[13,9,13,11],[0,5,0,7],[2,1,2,3],[13,1,13,3],[12,5,12,7],[2,5,2,7],[13,5,13,7],[8,4,8,7],[1,5,1,7],[0,0,0,2],[98,3,98,4],[20,1,20,2],[31,1,31,2],[5,3,5,7],[16,3,16,7],[27,3,27,7],[31,4,31,5],[28,3,28,7],[9,1,9,2],[9,4,9,5],[6,3,6,7],[19,1,19,2],[20,4,20,5],[30,1,30,2],[24,1,24,3],[30,4,30,7]]}
[{"$f":"IF(VALUE(W5)>0,\"Voll funktionsfähige Demoversion bis \"&INDEX(Monatsnamen,W4)&\" \"&W5,\"Vollversion SL-Urlaubsplaner\")","v":"Voll funktionsfähige Demoversion bis November 2017"},null,null,null,"Land / BL:","Bayern",null,null,false,null,null,{"$f":"CELL(\"Format\",INDIRECT(L2))","v":"S"},false,null,null,null,null,null,null,null,null,null,0,null,false,null,{"$f":"INDEX(Y6:Y17,MONTH(TODAY()))","v":"August"}]
["Urlaubsantrag",null,null,null,"Abteilung:",null,null,null,null,null,null,"N10",null,null,null,null,null,null,null,null,null,null,0,null,null,null,{"$f":"YEAR(TODAY())","v":2016},null,"2015-12-11"]
["Herr / Frau:",null,null,null,"Pers.-Nr.:",null,null,null,null,{"$f":"IF(ISBLANK(F3),\"\",VLOOKUP(F3,#REF!,2,FALSE))","v":""},null,null,null,null,null,"2013-11-01",null,null,null,null,null,null,1]
["Mein Urlaubsanspruch beträgt noch",null,null,{"$f":"IF(C4=1,\"Tag\",\"Tage\")","v":"Tage"},null,null,null,null,null,null,null,null,null,null,null,null,null,null,null,null,null,null,{"$f":"'Feiertage in den BL'!C1","v":11}]
["Davon wird Urlaub beantragt   am/vom",null,null,"bis einschl.",null,"=",null,{"$f":"IF(G5=1,\"Tag\",\"Tage\")","v":"Tage"},null,{"$f":"IF(H5=\"\",(1*F5>\"\")-D6,NETWORKDAYS(F5,H5)-D6)","v":{"$error":"#VALUE!"}},null,null,null,null,null,null,{"$f":"IF(AND(AC1=AC2,AC1>0),\"Enddatum anklicken\",\"\")","v":""},null,null,null,null,null,{"$f":"'Feiertage in den BL'!D1","v":2017}]
[null,{"$f":"IF(A6>1,\"Tage sind nicht anzurechnen, wegen\",\"Tag ist nicht anzurechnen, wegen\")","v":"Tag ist nicht anzurechnen, wegen"},null,null,null,null,null,null,null,null,null,null,null,null,null,null,null,null,null,null,null,null,null,1,"Januar",2013,1,{"$f":"VLOOKUP(N8,Y6:AA17,3,FALSE)","v":8},8,null,null,null,"Datum",{"$f":"R8","v":2016}]
[null,null,null,"(Geburt, Heirat, Umzug, Todesfall, etc.)",null,null,null,null,null,null,null,null,null,null,null,null,"Info",null,null,null,null,null,null,2,"Februar",2014,2,{"$f":"\"1.\"&AB6&\".\"&R8","v":"1.8.2016"},{"$f":"VLOOKUP(AC6,X6:Y17,2)","v":"August"},null,null,null,"Ostersonntag",{"$f":"DOLLAR((DAY(MINUTE(AH6/38)/2+55)&\".4.\"&AH6)/7,)*7-IF(YEAR(1)=1904,5,6)","v":"2016-03-27"},0,"D"]
["Aktueller Urlaubsanspruch jetzt noch",null,{"$f":"IF(C4-G5+A6=0,\"0\",C4-G5+A6)","v":"0"},{"$f":"IF(C8=1,\"Tag\",\"Tage\")","v":"Tage"},null,null,null,null,null,null,null,null,null,"August",null,null,null,2016,null,null,null,null,null,3,"März",2015,3,{"$f":"DATEVALUE(AB7)","v":42583},null,null,null,null,"Ostermontag",{"$f":"AH7+1","v":"2016-03-28"},1,"D"]
["Antragsteller:",null,null,"genehmigt:",null,null,null,null,null,null,null,null,null,"Mo","Di","Mi","Do","Fr","Sa","So",null,null,null,4,"April",2016,4,null,null,null,null,null,"Karfreitag",{"$f":"AH7-2","v":"2016-03-25"},1,"D"]
["Datum:",null,null,"Datum:",null,null,null,null,null,null,null,null,{"$f":"IF(WEEKNUM(N10)=53,1,WEEKNUM(N10))","v":31},"2015-07-27","2015-07-28","2015-07-29","2015-07-30","2015-07-31","2015-08-01","2015-08-02",null,null,null,5,"Mai",2017,5,null,null,null,null,null,"Christi Himmelfahrt",{"$f":"AH7+39","v":"2016-05-05"},1,"D"]
["!!  Der Urlaub ist in jedem Falle noch vor Antritt des Urlaubs im Personal- / Lohnbüro bzw. der zuständigen Stelle abzugeben  !!",null,null,null,null,null,null,null,null,null,null,null,32,"2015-08-03","2015-08-04","2015-08-05","2015-08-06","2015-08-07","2015-08-08","2015-08-09",null,null,null,6,"Juni",2018,6,null,null,null,null,null,"Pfingstsonntag",{"$f":"AH7+49","v":"2016-05-15"},1,"D"]
["- - - - - - - - - - - - - - - - - - - - - - - - - - - - - - - - - - - - - - - - - - - - - - - - - - - - - - - - - - - - - - - - - - - - - - - - - - - - - - - - - ",null,null,null,null,null,null,null,null,null,null,null,{"$f":"IF(WEEKNUM(N12)=53,\"KW 53/1\",WEEKNUM(N12))","v":33},"2015-08-10","2015-08-11","2015-08-12","2015-08-13","2015-08-14","2015-08-15","2015-08-16",null,null,null,7,"Juli",2019,7,null,null,null,null,null,"Pfingstmontag",{"$f":"AH7+50","v":"2016-05-16"},1,"D"]
["Urlaubsantrag",null,null,null,"Abteilung:",null,null,null,null,null,null,null,{"$f":"IF(WEEKNUM(N13)=53,\"KW 53/1\",WEEKNUM(N13))","v":34},"2015-08-17","2015-08-18","2015-08-19","2015-08-20","2015-08-21","2015-08-22","2015-08-23",null,null,null,8,"August",2020,8,null,null,null,null,null,"Fronleichnam",{"$f":"DATE(AH6,3,1)+MOD((255-11*MOD(AH6,19)-21),30)+21+(MOD((255-11*MOD(AH6,19)-21),30) + 21>48)+6-MOD(AH6+INT(AH6/4)+MOD((255- 11*MOD(AH6,19)- 21),30)+21+(MOD((255-11*MOD(AH6,19)-21),30)+21>48)+1,7)+60","v":"2016-05-26"},1,"D"]
["Herr / Frau:",null,null,null,"Pers.-Nr.:",null,null,null,null,null,null,null,{"$f":"IF(WEEKNUM(N14)=53,\"KW 53/1\",WEEKNUM(N14))","v":35},"2015-08-24","2015-08-25","2015-08-26","2015-08-27","2015-08-28","2015-08-29","2015-08-30",null,null,null,9,"September",2021,9,null,null,null,null,null,"Neujahr",{"$f":"DATE(AH6,1,1)","v":"2016-01-01"},1,"D"]
["Mein Urlaubsanspruch beträgt noch",null,null,{"$f":"IF(C15=1,\"Tag\",\"Tage\")","v":"Tage"},null,null,null,null,null,null,null,null,{"$f":"IF(WEEKNUM(N15)=53,\"KW 53/1\",WEEKNUM(N15))","v":36},"2015-08-31","2015-09-01","2015-09-02","2015-09-03","2015-09-04","2015-09-05","2015-09-06",null,null,null,10,"Oktober",2022,10,null,null,null,null,null,"Heilige Dreikönige",{"$f":"DATE(AH6,1,6)","v":"2016-01-06"},1,"D"]
["Davon wird Urlaub beantragt   am/vom",null,null,"bis einschl.",null,"=",null,{"$f":"IF(G16=1,\"Tag\",\"Tage\")","v":"Tage"},null,{"$f":"IF(H16=\"\",(1*F16>\"\")-D17,NETWORKDAYS(F16,H16)-D17)","v":{"$error":"#VALUE!"}},null,null,37,"2015-09-07","2015-09-08","2015-09-09","2015-09-10","2015-09-11","2015-09-12","2015-09-13",null,null,null,11,"November",2023,11,null,null,null,null,null,"Tag der Arbeit",{"$f":"DATE(AH6,5,1)","v":"2016-05-01"},1,"D"]
[null,{"$f":"IF(A17>1,\"Tage sind nicht anzurechnen, wegen\",\"Tag ist nicht anzurechnen, wegen\")","v":"Tag ist nicht anzurechnen, wegen"},null,null,null,null,null,null,null,null,null,null,38,"2015-09-14","2015-09-15","2015-09-16","2015-09-17","2015-09-18","2015-09-19","2015-09-20",null,null,null,12,"Dezember",2024,12,null,null,null,null,null,"Tag der deutschen Einheit",{"$f":"DATE(AH6,10,3)","v":"2016-10-03"},1,"D"]
[null,null,null,"(Geburt, Heirat, Umzug, Todesfall, etc.)",null,null,null,null,null,null,null,null,39,"2015-09-21","2015-09-22","2015-09-23","2015-09-24","2015-09-25","2015-09-26","2015-09-27",null,null,null,null,null,2025,null,null,null,null,null,null,"Allerheiligen",{"$f":"DATE(AH6,11,1)","v":"2016-11-01"},1,"D"]
["Aktueller Urlaubsanspruch jetzt noch",null,{"$f":"IF(C15-G16+A17=0,\"0\",C15-G16+A17)","v":"0"},{"$f":"IF(C19=1,\"Tag\",\"Tage\")","v":"Tage"},null,null,null,null,null,null,null,null,40,"2015-09-28","2015-09-29","2015-09-30","2015-10-01","2015-10-02","2015-10-03","2015-10-04",null,null,null,null,null,2026,null,null,null,null,null,null,"Buß- und Bettag",{"$f":"DATE(AH6,12,25)-WEEKDAY(DATE(AH6,12,25),2)-32","v":"2016-11-16"},0,"D"]
["Antragsteller:",null,null,"genehmigt:",null,null,null,null,null,null,null,null,41,"2015-10-05","2015-10-06","2015-10-07","2015-10-08","2015-10-09","2015-10-10","2015-10-11",null,null,null,null,null,2027,null,null,null,null,null,null,"1. Weihnachtstag",{"$f":"DATE(AH6,12,25)","v":"2016-12-25"},1,"D"]
["Datum:",null,null,"Datum:",null,null,null,null,null,null,null,null,null,null,null,null,null,null,null,null,null,null,null,null,null,null,null,null,null,null,null,null,"2. Weihnachtstag",{"$f":"DATE(AH6,12,26)","v":"2016-12-26"},1,"D"]
["!!  Der Urlaub ist in jedem Falle noch vor Antritt des Urlaubs im Personal- / Lohnbüro bzw. der zuständigen Stelle abzugeben  !!",null,null,null,null,null,null,null,null,null,null,null,null,null,null,null,null,null,null,null,null,null,null,null,null,"Test",null,null,null,null,null,null,"Schweizer Nationalfeiertag",{"$f":"IF($F$1=\"Schweiz  (CH)\",DATE(AH6,8,1),0)","v":"00:00:00"},0,"CH"]
["- - - - - - - - - - - - - - - - - - - - - - - - - - - - - - - - - - - - - - - - - - - - - - - - - - - - - - - - - - - - - - - - - - - - - - - - - - - - - - - - - ",null,null,null,null,null,null,null,null,null,null,null,null,null,null,null,null,null,null,null,null,null,null,null,null,null,null,null,null,null,null,null,"St. Josef (CH)",{"$f":"IF($F$1=\"Schweiz  (CH)\",DATE(AH6,3,19),0)","v":"00:00:00"},0,"CH",null,null,null,null,null,null,null,null,null,null,null,null,null,null,null,"C o p y  ri gh t   S o f  t w a r e  und  B ü  r o s e r v.  Ch r i s t i n e  S c h r e m  m er   S e l ig e n  st a d t"]
["Urlaubsantrag",null,null,null,"Abteilung:",null,null,null,null,null,null,null,null,null,null,null,null,null,null,null,null,null,null,null,null,null,null,null,null,null,null,null,"Berchtoldstag (CH)",{"$f":"IF($F$1=\"Schweiz  (CH)\",DATE(AH6,1,2),0)","v":"00:00:00"},0,"CH"]
["Herr / Frau:",null,null,null,"Pers.-Nr.:",null,null,null,null,{"$f":"IF(ISBLANK(F25),\"\",VLOOKUP(F25,#REF!,2,FALSE))","v":""},null,null,null,null,null,null,null,null,null,null,null,null,null,null,null,null,null,null,null,null,null,null,"Friedensfest Augsburg",{"$f":"IF($F$1=\"Bayern\",DATE(AH6,8,8),0)","v":"2016-08-08"},0,"D"]
["Mein Urlaubsanspruch beträgt noch",null,null,{"$f":"IF(C26=1,\"Tag\",\"Tage\")","v":"Tage"},null,null,null,null,null,null,null,null,null,null,null,null,null,null,null,null,null,null,null,null,null,null,null,null,null,null,null,null,"Österreichicher Nationalfeiertag (A)",{"$f":"IF($F$1=\"Österreich  (A)\",DATE(AH6,10,26),0)","v":"00:00:00"},0,"Ö"]
["Davon wird Urlaub beantragt   am/vom",null,null,"bis einschl.",null,"=",null,{"$f":"IF(G27=1,\"Tag\",\"Tage\")","v":"Tage"},null,{"$f":"IF(H27=\"\",(1*F27>\"\")-D28,NETWORKDAYS(F27,H27)-D28)","v":{"$error":"#VALUE!"}},null,null,null,null,null,null,null,null,null,null,null,null,null,null,null,null,null,null,null,null,null,null,"Mariä Himmelfahrt",{"$f":"DATE(AH6,8,15)","v":"2016-08-15"},0,"D"]
[null,{"$f":"IF(A28>1,\"Tage sind nicht anzurechnen, wegen\",\"Tag ist nicht anzurechnen, wegen\")","v":"Tag ist nicht anzurechnen, wegen"},null,null,null,null,null,null,null,null,null,null,null,null,null,null,null,null,null,null,null,null,null,null,null,null,null,null,null,null,null,null,"Reformationstag",{"$f":"DATE(AH6,10,31)","v":"2016-10-31"},0,"D"]
[null,null,null,"(Geburt, Heirat, Umzug, Todesfall, etc.)",null,null,null,null,null,null,null,null,null,null,null,null,null,null,null,null,null,null,null,null,null,null,null,null,null,null,null,null,"Maria Empfängnis",{"$f":"IF(OR($F$1=\"Schweiz  (CH)\",$F$1=\"Österreich  (A)\"),DATE(AH6,12,8),0)","v":"00:00:00"},0,"ÖCH"]
["Aktueller Urlaubsanspruch jetzt noch",null,{"$f":"IF(C26-G27+A28=0,\"0\",C26-G27+A28)","v":"0"},{"$f":"IF(C30=1,\"Tag\",\"Tage\")","v":"Tage"},null,null,null,null,null,null,null,null,null,null,null,null,null,null,null,null,null,null,null,null,null,null,null,null,null,null,null,null,"Datum",{"$f":"AH6+1","v":2017},0,"D"]
["Antragsteller:",null,null,"genehmigt:",null,null,null,null,null,null,null,null,null,null,null,null,null,null,null,null,null,null,null,null,null,null,null,null,null,null,null,null,"Ostersonntag",{"$f":"DOLLAR((DAY(MINUTE(AH30/38)/2+55)&\".4.\"&AH30)/7,)*7-IF(YEAR(1)=1904,5,6)","v":"2017-04-16"},0,"D"]
["Datum:",null,null,"Datum:",null,null,null,null,null,null,null,null,null,null,null,null,null,null,null,null,null,null,null,null,null,null,null,null,null,null,null,null,"Ostermontag",{"$f":"AH31+1","v":"2017-04-17"},1,"D"]
["!!  Der Urlaub ist in jedem Falle noch vor Antritt des Urlaubs im Personal- / Lohnbüro bzw. der zuständigen Stelle abzugeben  !!",null,null,null,null,null,null,null,null,null,null,null,null,null,null,null,null,null,null,null,null,null,null,null,null,null,null,null,null,null,null,null,"Karfreitag",{"$f":"AH31-2","v":"2017-04-14"},1,"D"]
[null,null,null,null,null,null,null,null,null,null,null,null,null,null,null,null,null,null,null,null,null,null,null,null,null,null,null,null,null,null,null,null,"Christi Himmelfahrt",{"$f":"AH31+39","v":"2017-05-25"},1,"D"]
[null,null,null,null,null,null,null,null,null,null,null,null,null,null,null,null,null,null,null,null,null,null,null,null,null,null,null,null,null,null,null,null,"Pfingstsonntag",{"$f":"AH32+49","v":"2017-06-05"},1,"D"]
[null,null,null,null,null,null,null,null,null,null,null,null,null,null,null,null,null,null,null,null,null,null,null,null,null,null,null,null,null,null,null,null,"Pfingstmontag",{"$f":"AH32+50","v":"2017-06-06"},1,"D"]
[null,null,null,null,null," ",null,null,null,null,null,null,null,null,null,null,null,null,null,null,null,null,null,null,null,null,null,null,null,null,null,null,"Fronleichnam",{"$f":"DATE(AH30,3,1)+MOD((255-11*MOD(AH30,19)-21),30)+21+(MOD((255-11*MOD(AH30,19)-21),30) + 21>48)+6-MOD(AH30+INT(AH30/4)+MOD((255- 11*MOD(AH30,19)- 21),30)+21+(MOD((255-11*MOD(AH30,19)-21),30)+21>48)+1,7)+60","v":"2017-06-15"},1,"D"]
[null,null,null,null,null,null,null,null,null,null,null,null,null,null,null,null,null,null,null,null,null,null,null,null,null,null,null,null,null,null,null,null,"Neujahr",{"$f":"DATE(AH30,1,1)","v":"2017-01-01"},1,"D"]
[null,null,null,null,null,null,null,null,null,null,null,null,null,null,null,null,null,null,null,null,null,null,null,null,null,null,null,null,null,null,null,null,"Heilige Dreikönige",{"$f":"DATE(AH30,1,6)","v":"2017-01-06"},1,"D"]
[null,null,null,null,null,null,null,null,null,null,null,null,null,null,null,null,null,null,null,null,null,null,null,null,null,null,null,null,null,null,null,null,"Tag der Arbeit",{"$f":"DATE(AH30,5,1)","v":"2017-05-01"},1,"D"]
{"$rows_left_out":294}
{"sheet":"Abteilungen","index":1,"n_rows":39,"n_cols":29,"rows_kept":39,"cut":false,"hidden":false,"merged":[[0,2,0,3]]}
["Abteilung",{"$f":"IF('Feiertage in den BL'!C1=\"\",'Feiertage in den BL'!E1,\"DemoFirma\")","v":"DemoFirma"},{"$f":"IF('Feiertage in den BL'!C1=\"\",'Feiertage in den BL'!F1,\"DemoAnschrift\")","v":"DemoAnschrift"},null,null,null,null,null,null,null,null,null,null,null,null,null,null,null,null,null,null,null,0]
["EDV",null,"keine Leerzeilen !",null,null,null,null,null,null,null,null,null,null,null,null,null,null,null,null,null,null,null,0]
["Büro",null,"keine Leerzeilen !"]
[null,null,"keine Leerzeilen !"]
[null,null,"keine Leerzeilen !"]
[null,null,"keine Leerzeilen !",null,null,null,null,null,null,null,null,null,null,null,null,null,null,null,null,null,null,null,null,null,null,null,null,null,1]
[null,null,"keine Leerzeilen !"]
[null,null,"keine Leerzeilen !"]
[null,null,"keine Leerzeilen !"]
[null,null,"keine Leerzeilen !"]
[null,null,"keine Leerzeilen !"]
[null,null,"keine Leerzeilen !"]
[null,null,"keine Leerzeilen !"]
[null,null,"keine Leerzeilen !"]
[null,null,"keine Leerzeilen !"]
[null,null,"keine Leerzeilen !"]
[null,null,"keine Leerzeilen !"]
[null,null,"keine Leerzeilen !"]
[null,null,"keine Leerzeilen !"]
[null,null,"keine Leerzeilen !"]
[null,null,"keine Leerzeilen !"]
[null,null,"keine Leerzeilen !"]
[null,null,"keine Leerzeilen !"]
[null,null,"keine Leerzeilen !"]
[null,null,"keine Leerzeilen !"]
[null,null,"keine Leerzeilen !"]
[null,null,"keine Leerzeilen !"]
[null,null,"keine Leerzeilen !"]
[null,null,"keine Leerzeilen !"]
[null,null,"keine Leerzeilen !"]
[null,null,"keine Leerzeilen !"]
[null,null,"keine Leerzeilen !"]
[null,null,"keine Leerzeilen !"]
[null,null,"keine Leerzeilen !"]
[null,null,"keine Leerzeilen !"]
[null,null,"keine Leerzeilen !"]
[null,null,"keine Leerzeilen !"]
[null,null,"keine Leerzeilen !"]
[null,null,"keine Leerzeilen !"]

{"sheet":"Namen","index":2,"n_rows":667,"n_cols":29,"rows_kept":667,"cut":false,"hidden":false,"merged":[[0,1,0,2]]}
[{"$f":"IF('Feiertage in den BL'!C1=\"\",'Feiertage in den BL'!E1,\"DemoFirma\")","v":"DemoFirma"},{"$f":"IF('Feiertage in den BL'!C1=\"\",'Feiertage in den BL'!F1,\"DemoAnschrift\")","v":"DemoAnschrift"},null,"                               Pfad zu den UP-Daten:",null,null,"C:\\Urlaubsplaner\\2016\\Version 2.16\\Deutschland\\sonstiges",null,null,null,null,null,null,null,null,null,null,null,null,null,null,null,0]
["Name, Vorname","Personal-Nr.","Abteilung","                               Dateiname:                             Name-Abteilung-Pers.Nr.xls",null,null,null,null,null,null,null,null,null,null,null,null,null,null,null,null,null,null,0]
["Mustermann",123456,null,"keine Leerzeilen !",null,null,null,null,null,null,null,null,null,null,null,null,null,null,null,null,null,null,0]
["Müller, Achim",456789,null,"keine Leerzeilen !"]
[null,null,null,"keine Leerzeilen !"]
[null,null,null,"keine Leerzeilen !",null,">  Jedem Mitarbeiter sollte eine Abteil. und eine Pers.-Nr. zugeordnet sein!",null,null,null,null,null,null,null,null,null,null,null,null,null,null,null,null,null,null,null,null,null,null,1]
[null,null,null,"keine Leerzeilen !",null,">  Bitte von Hand aktualisieren, siehe \"Bedienungsanleitung\" !"]
[null,null,null,"keine Leerzeilen !"]
[null,null,null,"keine Leerzeilen !"]
[null,null,null,"keine Leerzeilen !"]
[null,null,null,"keine Leerzeilen !"]
[null,null,null,"keine Leerzeilen !"]
[null,null,null,"keine Leerzeilen !"]
[null,null,null,"keine Leerzeilen !"]
[null,null,null,"keine Leerzeilen !"]
[null,null,null,"keine Leerzeilen !"]
[null,null,null,"keine Leerzeilen !"]
[null,null,null,"keine Leerzeilen !"]
[null,null,null,"keine Leerzeilen !"]
[null,null,null,"keine Leerzeilen !"]
[null,null,null,"keine Leerzeilen !"]
[null,null,null,"keine Leerzeilen !"]
[null,null,null,"keine Leerzeilen !"]
[null,null,null,"keine Leerzeilen !"]
[null,null,null,"keine Leerzeilen !"]
[null,null,null,"keine Leerzeilen !"]
[null,null,null,"keine Leerzeilen !"]
[null,null,null,"keine Leerzeilen !"]
[null,null,null,"keine Leerzeilen !"]
[null,null,null,"keine Leerzeilen !"]
[null,null,null,"keine Leerzeilen !"]
[null,null,null,"keine Leerzeilen !"]
[null,null,null,"keine Leerzeilen !"]
[null,null,null,"keine Leerzeilen !"]
[null,null,null,"keine Leerzeilen !"]
[null,null,null,"keine Leerzeilen !"]
[null,null,null,"keine Leerzeilen !"]
[null,null,null,"keine Leerzeilen !"]
[null,null,null,"keine Leerzeilen !"]
[null,null,null,"keine Leerzeilen !"]
{"$rows_left_out":628}
{"sheet":"Feiertage in den BL","index":3,"n_rows":140,"n_cols":23,"rows_kept":140,"cut":false,"hidden":true,"merged":[]}
["Feiertage in den deutschen BL 2014",null,11,2017,"Testfirma GmbH & Co. KG","Max Mustermann","Testfirma GmbH & Co. KG","Max Mustermann"]
[null,"Neujahr","Berchtoldstag (CH)","Heilige Dreikönige","St. Josef (CH)","Karfreitag","Ostersonntag","Ostermontag","Tag der Arbeit","Christi Himmelfahrt","Pfingstsonntag","Fronleichnam","Schweizer Nationalfeiertag","Friedensfest Augsburg","Mariä Himmelfahrt","Tag der deutschen Einheit","Österreichicher Nationalfeiertag (A)","Reformationstag","Allerheiligen","Buß- und Bettag","Maria Empfängnis","1. Weihnachtstag","2. Weihnachtstag"]
[null,"1.1.","2.1.","6.1.","19.3.","18.4.","20.4.","21.4.","1.5.","29.5.","9.6.","19.6.","1.8.","8.8.","15.8.","3.10.","26.10.","31.10.","1.11.","19.11.","8.12.","25.12.","26.12."]
["Baden-Württemberg",null,null,"x",null,"x",null,"x","x","x","x","x",null,null,null,"x",null,null,"x",null,null,"x","x"]
["Bayern","x",null,"x",null,"x",null,"x","x","x","x","x",null,"xx","xx","x",null,null,"x",null,null,"x","x"]
["Berlin"," ",null,null,null,"x",null,"x","x","x","x",null,null,null,null,"x",null,null,null,null,null,"x","x"]
["Brandenburg","x",null,null,null,"x","x","x","x","x","x",null,null,null,null,"x",null,"x",null,null,null,"x","x"]
["Bremen","x",null,null,null,"x",null,"x","x","x","x",null,null,null,null,"x",null,null,null,null,null,"x","x"]
["Hamburg","x",null,null,null,"x",null,"x","x","x","x","x",null,null,null,"x",null,null,null,null,null,"x","x"]
["Hessen","x",null,null,null,"x",null,"x","x","x","x",null,null,null,null,"x",null,null,null,null,null,"x","x"]
["Mecklenburg-Vorpom.","x",null,null,null,"x",null,"x","x","x","x",null,null,null,null,"x",null,"x",null,null,null,"x","x"]
["Niedersachsen","x",null,null,null,"x",null,"x","x","x","x",null,null,null,null,"x",null,null,null,null,null,"x","x"]
["Nordrhein-Westfalen","x",null,null,null,"x",null,"x","x","x","x","x",null,null,null,"x",null,null,"x",null,null,"x","x"]
["Rheinland-Pfalz","x",null,null,null,"x",null,"x","x","x","x","x",null,null,null,"x",null,null,"x",null,null,"x","x"]
["Saarland","x",null,null,null,"x",null,"x","x","x","x","x",null,null,"x","x",null,null,"x",null,null,"x","x"]
["Sachsen","x",null,null,null,"x",null,"x","x","x","x","xx",null,null,null,"x",null,"x",null,"x",null,"x","x"]
["Sachsen-Anhalt","x",null,"x",null,"x",null,"x","x","x","x",null,null,null,null,"x",null,"x",null,null,null,"x","x"]
["Schleswig-Holstein","x",null,null,null,"x",null,"x","x","x","x",null,null,null,null,"x",null,null,null,null,null,"x","x"]
["Thüringen","x",null,null,null,"x",null,"x","x","x","x","xx",null,null,null,"x",null,"x",null,null,null,"x","x"]
["Österreich  (A)","x",null,"x",null,"xx",null,"x","x","x","x","x",null,null,"x",null,"x","x","x",null,"x","x","x"]
["Schweiz  (CH)","x","xx","xx","xx","xx",null,"xx","xx","x","xx","xx","x",null,"xx",null,null,null,"xx",null,"xx","x","xx"]
[]
[]
[]
[]
[]
[]
[]
[]
[]
[]
[]
[]
[]
[]
[]
[]
[]
["CLITFB","ENQUTW"]
["Anfrage","Freischaltcode"]
{"$rows_left_out":101}
{"sheet":"! Bedienungsanleitung !","index":4,"n_rows":167,"n_cols":30,"rows_kept":167,"cut":false,"hidden":false,"merged":[[86,10,86,17],[90,10,90,17],[87,1,87,7],[141,1,141,8],[147,1,147,6],[148,1,148,6],[149,1,149,6],[79,1,79,8],[80,1,80,8],[76,1,76,8],[77,1,77,8],[157,12,157,17],[154,1,154,6],[155,1,155,6],[156,1,156,6],[157,1,157,6],[159,1,159,6],[160,1,160,6],[0,6,0,8],[17,1,17,8],[21,1,21,6],[118,4,118,8],[117,4,117,8],[88,1,88,5],[92,1,92,8],[153,1,153,6],[158,1,158,6],[74,1,74,8],[75,1,75,8],[85,1,85,7],[150,1,150,6],[152,1,152,6],[53,1,53,8],[166,1,166,6],[167,1,167,6],[151,1,151,7],[18,1,18,6],[20,1,20,6],[22,1,22,6],[26,1,26,6],[161,1,161,6],[162,1,162,6],[163,1,163,6],[164,1,164,6],[165,1,165,6],[32,1,32,6],[140,1,140,8],[142,1,142,8],[23,1,23,8],[2,13,2,15],[75,11,75,18],[74,11,74,18],[35,1,35,8],[73,3,73,8],[2,2,2,5],[3,2,3,5],[28,1,28,4],[30,1,30,8],[29,1,29,8],[50,1,50,8],[50,12,50,19],[24,1,24,6],[51,1,51,8],[52,1,52,8]]}
["SL-Tool:  \"SL-UrlaubsAntrag\" - Excel-Zusatzmodul zum \"SL-Urlaubsplaner\"",null,null,null,null,null,"Vers.1.3 v. 09.11.2015",null,null,null,"letzter Stand:   03.09.2014",null,null,null,null,null,null,null,null,null,null,null,0,0]
[null,null,null,null,null,null,null,null,null,null,null,null,null,null,null,null,null,null,null,null,null,null,0,0]
["Software-Entwickler:",null,"Software und Büroservice Christine Schremmer & Jörg Lortz\n63500 Seligenstadt,   Odenwaldring 13, Tel.:  06182 - 787 3203\nMail:  christine.schremmer@t-online.de"]
[null,null,"Stefan Ludewig,  63796  Kahl/Main,  Hauptstraße 23\nMail:  St.Ludewig@AOL.com"]
[]
[]
["Info und Bedienungsanleitung"]
["1.","Funktionen:  Voll- bzw. Demoversion",null,null,"5.     Screenshots / Videos"]
["2.","Installation / Bestellen",null,null,"6.     Systemvoraussetzung, Einstellungen"]
["3.","Datenübernahme aus dem Urlaubsplaner (UP) ",null,null,"7.     Preise - Bestellen"]
["4.","Anwendungsbeispiele",null,null,"8.     Kontakt / Rechte / Gewährleistung"]
[]
[]
[null,null,null,null,null,null,null,null,null,null,null,null,null,null,null,null,null,null,null,null,null,null,null,null,null,null,null,null,1,1]
["Info und Bedienungsanleitung"]
[]
["1.","Funktionen:  Voll- und Demofunktion"]
[null,"Das Excel-Tool übernimmt die Personaldaten aus dem \"SL-Urlaubsplaner\", siehe Pkt. 3., und listet"]
[null,"-  die verschiedenen Abteilungen  in das Register-Blatt \"Abteilungen\" "]
[null,"-  alle Mitarbeiter:  Name, Vorname, Abteilung und Personal-Nr. werden in das  Blatt \"Namen\" geschrieben"]
[null,"-  die Einträge können bearbeitet, erweitert und sortiert werden"]
[null,"-  alle dt. Bundesländer, Österreich und Schweiz mit den jeweils gültigen Feiertagen"]
[null,"-  Datumspicker, … , siehe Pkt. 4."]
[null,"-  Wochendend- und Feiertagsarbeit wird bei der Urlaubsberechnung berücksichtigt, siehe Video u. Pkt. 4."]
[null,"-  variabler Formularausdruck"]
[]
["2.","Installation / Bestellen"]
["2a","Installation der Demoversion,  Dateiname:  \"SL-UrlaubsAntrag.xlsm\" "]
[null,"-  Demoversion speichern, empfohlen nach:   C : \\ Urlaubsplaner",null,null,null,null,"siehe auch  2i"]
[null,"   (empfohlen wird eine Sicherheitskopie)"]
[null,"-  Demoversion erneut öffnen und anwenden - Voll funktionsfähig bis 30.Juni 2016 \n    ohne Begrenzung der Konten-Anzahl !"]
["2b","Bestellen der Vollversion"]
[null,"Testen Sie erst die voll funktionsfähige und kostenlose Demoversion, bevor Sie die Vollversion bestellen!\n \nDie Vollfunktion können Sie direkt aus der Demoversion heraus bestellen, siehe 2c ...."]
[]
["2c","Demoversion erneut öffnen  >  Klicken Sie auf "]
[null,"Bestellformular ausfüllen:  Name bzw. Firma - Straße - PLZ  Ort"]
[]
[]
[]
[]
{"$rows_left_out":127}